{"text_format":"1","workbook":"xlsx","n_sheets":4,"sheets":["Instructions","Fill ACR","Sheet1","Sheet4"],"not_rendered":{"charts":0,"images":0,"macros":1,"external_links":1,"defined_names":3,"comments":0,"pivot_tables":0},"unopened":[],"bounds":{"document_bytes":16777216,"sheet_cells":100000,"rows_first":2000,"rows_last":500,"rows_between":2000,"halvings":0,"cell_chars":16384,"cell_head_chars":4096},"cells_cut":0,"cells_raw":0,"read":"whole","date_system":"1900"}

{"sheet":"Instructions","index":0,"n_rows":12,"n_cols":2,"rows_kept":12,"cut":false,"hidden":false,"merged":[[0,0,0,1]]}
["ey.sI.Awr Brn leI jrrI hdwieqW"]
[1,"quhwfy kMipaUtr qy AnmolilpI PONt hoxw cwhIdw hY (USE Anmolipi Font)"]
[2,"AyYksl 2010 jW ies qoN aupr dw AwiPs dI vrqoN kro"]
[3,"PwieL Kulx qy Enabed Content And Enable Editing btn jo aupr tUlbwr dy hyTw nzr Awvygw aus nUM kil`k krO qW hI shI Awautpu`t AwvygI . jy Aijhw krn qoN rih igAw qW Pweil nUM dubwrw bMd krky aupn kro"]
[4,"qsI Fill ACR sIt qy  kil`k krky auQy isrP pIly Kwny hI Brny hn"]
[5,"Awpxw fwtw iP`l krn qo bwAd iesy swPt kwpI Pwiel qy mu`KI qo nMbr lgvw skdy ho"]
[6,"lwst ivc qusI pIfI.AYP dy rUp ivc syv kr skdy ho"]
[7,"ipRMt k`Fx leI hryk puj leI pyj vwiej rwiet swief btn idqy hn (qW jo pyj dy A`gy ipCy ipMRt k`Fy jw skx_"]
[8,"qusI iksy qrW dy suJwA Aqy PIfbYk leI eImyl AweI. abhi072011@gmail.com qy spMrk kr skdy ho"]
[7,"iesy qrW dy hor swPtvyAr Pwrm Aid pRwpq krn leI swfI vYbswiet nUM ivijt kro "]
[8,"Subscribe Our Youtube Channel for Details Video"]
[9,"Follow Us On Facebook"]

{"sheet":"Fill ACR","index":1,"n_rows":177,"n_cols":21,"rows_kept":177,"cut":false,"hidden":false,"merged":[[141,3,146,3],[139,4,139,11],[137,3,138,3],[140,4,140,11],[145,4,145,11],[141,4,141,11],[142,4,142,11],[143,4,143,11],[144,4,144,11],[146,4,146,11],[133,4,133,11],[134,4,134,11],[132,13,136,13],[132,14,136,14],[137,4,137,11],[138,4,138,11],[137,13,138,13],[137,14,138,14],[141,13,146,13],[141,14,146,14],[122,3,126,3],[127,4,127,11],[127,13,131,13],[127,14,131,14],[128,4,128,11],[129,4,129,11],[130,4,130,11],[131,4,131,11],[132,4,132,11],[118,4,118,11],[119,4,119,11],[120,4,120,11],[121,4,121,11],[117,13,121,13],[117,14,121,14],[122,4,122,11],[122,13,126,13],[122,14,126,14],[123,4,123,11],[124,4,124,11],[125,4,125,11],[126,4,126,11],[115,4,115,11],[116,4,116,11],[117,4,117,11],[107,4,107,11],[106,13,109,13],[106,14,109,14],[110,3,110,14],[112,13,116,13],[112,14,116,14],[71,4,71,11],[73,4,73,11],[74,4,74,11],[75,4,75,11],[76,4,76,11],[96,4,96,11],[93,13,96,13],[93,14,96,14],[98,4,98,11],[97,13,99,13],[97,14,99,14],[72,4,72,11],[149,3,149,11],[149,12,149,13],[84,4,84,11],[82,4,82,11],[83,4,83,11],[85,4,85,11],[86,4,86,11],[87,4,87,11],[82,13,87,13],[82,3,87,3],[83,12,87,12],[99,4,99,11],[100,4,100,11],[101,4,101,11],[102,4,102,11],[103,4,103,11],[104,4,104,11],[135,4,135,11],[97,3,99,3],[101,13,103,13],[101,3,103,3],[105,4,105,11],[106,4,106,11],[114,4,114,11],[150,3,150,13],[151,12,151,13],[152,3,152,14],[151,7,151,11],[147,4,147,13],[94,4,94,11],[95,4,95,11],[88,4,88,11],[89,4,89,11],[90,4,90,11],[91,4,91,11],[92,4,92,11],[93,4,93,11],[136,4,136,11],[97,4,97,11],[88,3,91,3],[88,13,91,13],[88,14,91,14],[101,14,103,14],[108,4,108,11],[109,4,109,11],[111,4,111,11],[112,4,112,11],[113,4,113,11],[154,4,154,14],[79,4,79,11],[80,4,80,11],[9,4,9,6],[9,7,9,9],[34,9,34,14],[35,3,35,8],[3,3,3,5],[3,6,3,14],[4,4,4,9],[4,10,4,14],[5,10,5,11],[12,4,12,6],[12,7,12,9],[10,10,10,11],[10,12,10,14],[9,10,9,11],[9,12,9,14],[6,4,6,9],[6,10,6,14],[7,4,7,9],[7,10,7,14],[8,4,8,9],[5,12,5,14],[155,3,167,3],[156,4,157,7],[156,9,156,14],[157,9,157,14],[160,4,161,7],[160,9,160,14],[161,9,161,14],[164,4,165,7],[164,9,164,14],[165,9,165,14],[167,4,167,14],[53,3,56,3],[53,4,53,11],[53,13,56,13],[53,14,56,14],[54,4,54,11],[55,4,55,11],[56,4,56,11],[14,10,14,14],[37,12,41,14],[0,3,0,14],[1,3,1,14],[2,3,2,9],[2,10,2,11],[2,12,2,14],[8,10,8,14],[10,4,10,6],[10,7,10,9],[12,10,12,11],[12,12,12,14],[5,4,5,5],[5,6,5,9],[68,4,68,11],[38,4,38,8],[15,4,15,9],[15,10,15,14],[37,4,37,9],[16,4,16,9],[16,10,16,14],[17,4,17,9],[29,10,29,11],[30,10,30,11],[18,4,18,9],[57,14,60,14],[67,13,69,13],[67,14,69,14],[57,13,60,13],[13,4,13,9],[13,10,13,14],[14,4,14,9],[50,3,50,14],[45,5,45,8],[70,4,70,11],[38,3,41,3],[11,4,11,9],[11,10,11,14],[57,3,60,3],[44,5,44,8],[57,4,57,11],[58,4,58,11],[18,10,18,14],[23,4,23,14],[24,4,24,14],[19,4,19,9],[19,10,19,14],[20,4,20,8],[34,4,34,7],[51,3,51,14],[17,10,17,14],[66,4,66,11],[28,8,28,9],[69,4,69,11],[61,4,61,11],[64,4,64,11],[65,4,65,11],[26,10,26,11],[26,8,26,9],[27,8,27,9],[27,10,27,11],[28,10,28,11],[62,4,62,11],[63,4,63,11],[29,8,29,9],[30,8,30,9],[31,8,31,9],[33,4,33,14],[39,4,39,9],[52,4,52,11],[67,4,67,11],[59,4,59,11],[60,4,60,11],[42,12,45,14],[43,4,43,8],[62,13,66,13],[67,3,69,3],[62,14,66,14],[70,14,73,14],[74,14,76,14],[74,13,76,13],[82,14,87,14],[77,13,81,13],[77,14,81,14],[21,4,21,9],[21,10,21,14],[22,3,22,14],[26,13,26,14],[27,13,32,14],[32,5,32,6],[70,13,73,13],[78,4,78,11],[77,4,77,11],[81,4,81,11],[42,4,42,10],[48,4,48,13],[47,3,47,14],[31,10,31,11],[32,10,32,11],[32,8,32,9]]}
[null,null,null,"pRwiemrI AiDAwpkW (eI.tI.tI.AyY`c.tI) dI slwnw mulWkx irport \n(ey.sI.Awr.-1)"]
[null,null,null,"swl : 2022-23"]
[null,null,null,"Bwg - a   mu~FlI jwxkwrI",null,null,null,null,null,null,"XU fweIs kof :  "]
[null,null,null,"skUl dw nW Aqy ijlHw :  "]
[null,null,null,1,"AiDAwpk/AiDAwpkw dw nW"]
[null,null,null,2,"Ahudw",null,null,null,null,null,"E-Punjab ID No. :"]
[null,null,null,3,"ipqw dw nW"]
[null,null,null,4,"ilMg (iesqrI / purS)"]
[null,null,null,5,"jnm imqI"]
[null,null,null,6,"ADwr kwrf nMbr",null,null,null,null,null,"pYn nM:"]
[null,null,null,7,"spMrk nMbr :   mobwiel nM:",null,null,null,null,null,"eI.myl AweI.fI."]
[null,null,null,8,"mu~FlI qnKwh / gRyf py"]
[null,null,null,9,"sInIAwrqw nMbr",null,null,null,null,null,"jI.pI.AYP.nM:/prwn"]
[null,null,null,10,"syvw kwfr (styt/ijlHw/jW hor)"]
[null,null,null,11,"is~iKAw ivBwg iv~c hwzr hox dI imqI"]
[null,null,null,12,"mOjUdw kwfr qy hwzr hox dI imqI"]
[null,null,null,13,"mOjUdw stySn qy hwzr hox dI imqI"]
[null,null,null,14,"syvw mukq hox dI imqI"]
[null,null,null,15,"ividAk Xogqw"]
[null,null,null,16,"irport krn vwly AiDkwrI ADIn syvw krn dw smW kwl"]
[null,null,null,17,"AiDAwpk v~loN kYlMfr swl iv`c leIAW Cu~tIAW: ",null,null,null,null,"ieq: Cu~tI",null,"mYfIkl",0,"kmweI",0]
[null,null,null,18,"sYSn dOrwn jykr koeI ivBwgI szW heI hY qW aus dw vyrvW:"]
[null,null,null,"   Bwg -A  (pRI-mulMkx SIt)"]
[null,null,null,"1.","AiDAwpk duAwrw sbMDq swl dOrwn inBweIAW ivSyS syvwvW dw sMKyp vrxn :"]
[]
[null,null,null,"2.","AiDAwpk dy nqIjy"]
["Class3","class2",null,null,"lVIN nM:","jmwq","ivSw","ividAwrQIAW dI ku`l igxqI","pVOH pMjwb, pVHwE pMjwb tIcwe pRwpq,pMjvIN borf dw nqIjw ivid. pws pRqIsqW",null,"AMiqm jWc Anuswr pVOH pMjwb, pVHwE pMjwb tIcw pRwpq,pMjvIN borf dI rwj (jmwq Anuswr) pRqIsqqW",null,"vwDw / Gwtw %","Bwg e Anuswr gxnW kIqy 200 iv~coN AMk",null,null,"Total",null,null,null,"pws ivid. dI igxqI"]
[{"$f":"B28&1","v":{"$error":"#REF!"}},{"$f":"VLOOKUP(C28,#REF!,2,FALSE)","v":{"$error":"#REF!"}},null,null,1,"ਪਹਿਲੀ",null,null,{"$f":"IFERROR(ROUND((U28/H28)*100,2),\"\")","v":""},null,null,null,{"$f":"IF(I28=\"\",\"\",I28-K28)","v":""},{"$f":"IFERROR(Q28+Q29+Q30+Q31,0)","v":0},null,null,{"$f":"ROUND(IF(I33>K33,160,((I33/K33)*160)),0)","v":{"$error":"#DIV/0!"}},null,null,null,10]
[{"$f":"B29&1","v":{"$error":"#REF!"}},{"$f":"VLOOKUP(C29,#REF!,2,FALSE)","v":{"$error":"#REF!"}},null,null,2,null,null,null,{"$f":"IFERROR(ROUND((U29/H29)*100,2),\"\")","v":""},null,null,null,{"$f":"IF(I29=\"\",\"\",I29-K29)","v":""},null,null,null,{"$f":"IF(I33=100,40,ROUND(IF(I33>K33,(M33*40)/(100-K33),0),0))","v":0}]
[{"$error":"#REF!"},{"$f":"VLOOKUP(C30,#REF!,2,FALSE)","v":{"$error":"#REF!"}},null,null,3,null,null,null,"",null,null,null,""]
[{"$error":"#REF!"},{"$f":"VLOOKUP(C31,#REF!,2,FALSE)","v":{"$error":"#REF!"}},null,null,4,{"$f":"IFERROR(VLOOKUP(C31,#REF!,3,FALSE),\"\")","v":""},null,null,"",null,null,null,""]
[{"$error":"#REF!"},{"$f":"VLOOKUP(C32,#REF!,2,FALSE)","v":{"$error":"#REF!"}},null,null,5,{"$f":"IFERROR(VLOOKUP(C32,#REF!,3,FALSE),\"\")","v":""},null,null,{"$f":"IFERROR(ROUND((V32/H32)*100,2),\"\")","v":""},null,null,null,""]
[null,null,null,null,null,"ku~l/AOsq pRqISq",null,{"$f":"IFERROR(AVERAGE(H28:H32),0)","v":0},{"$f":"IFERROR(AVERAGE(I28:J32),0)","v":0},null,{"$f":"IFERROR(AVERAGE(K28:L32),0)","v":0},{"$f":"IFERROR(AVERAGE(L28:L32),0)","v":0},{"$f":"IFERROR(ROUND(AVERAGE(M28:M32),0),0)","v":0}]
[null,null,null,null,"(ie`k qoN v`D jmwqW pVHwaux dI sUrq iv`c sbMDq jmwqW dI AOsq pRqISqqw drj kIqI jwvygI[pMjvIN jmwq ivc borf dI pws pRqISqqW BrI jwvy)"]
[null,null,null,null,null,null,null,null,null,"AiDAwpk/AiDAwpkW dy hsqwKr"]
[null,null,null,"Bwg e : AiDAwpk dI mulWkx dI ivDI:",null,null,null,null,null,"ku~l AMk =200"]
[]
[null,null,null,1,"styt dy brwbr tIcw pUrw krn qy pRwpq AMk (ku`l AMk 160 )",null,null,null,null,null,"….. AMk",null,{"$f":"\" ies Bwg dy pRwpq AMk = \" & Q28","v":{"$error":"#DIV/0!"}}]
[null,null,null,".         2","jykr tIcw styt dy tIcy dI pRqISqqw qoN G`t hY qW :"]
[null,null,null,null,"nqIjw cwrt Anuswr AiDAwpk dI AOsq tIcw pwRpqI pRqISqqw",null,null,null,null,null,"…..a"]
[null,null,null,null,"   styt dy tIcy dI AOsq pRqISqqw..............",null,null,null,null,null,"…..A"]
[null,null,null,null,"AiDAwpk nUM imlx vwly AMk (160 AMkW iv~coN)",null,null,null,null,null,"…..160  X a/A"]
[null,null,null,3,"jykr nqIjw styt dy tIcy dI pRqISqqw qoN v`D hY qW:- (40 AMkW iv`coN)",null,null,null,null,null,null,null,{"$f":"\" ies Bwg dy pRwpq AMk = \" & Q29","v":" ies Bwg dy pRwpq AMk = 0"}]
[null,null,null,null,"AMk dyx dw sUqr :"]
[null,null,null,null,null,"AiDAwpk dw styt tIcy dI pws % qoN v`D nqIjww X 40"]
[null,null,null,null,null,"100  - styt dw tIcw",null,null,null,"(100 % nqIjy leI = 160 AMk)"]
[]
[null,null,null,"not :-1. jykr iksy AiDAwpk dI jmwq dw nqIjw Aqy styt dw nqIjw 100% hY qW aus AiDAwpk nUM\n      200 iv`coN pUry AMk id`qy jwxgy["]
[null,null,null,null,"2. jykr  AiDAwpk Bwg e dy ku`l AMkW dw 40% AMk pRwpq krdw hY qW hI Akwdimk Aqy sih-Akwdimk  gqIivDIAW dy pRwpq kIqy Amk joVy jwxgy["]
[]
[null,null,null,"Bwg s. irport krn vwly AiDkwrI v~loN mulWkx"]
[null,null,null,"(s-1) Akwdimk gqIivDIAW"]
[null,null,null,"lVI nM:","Akwdimk gqIivDIAW",null,null,null,null,null,null,null,"ku~l AMk","v~D qoN v~D AMk","pRwpq AMk"]
[null,null,null,"\n1","AiDAwpk v~loN skUl iv`c b~icAW dI igxqI iv~c vwDw krn leI kIqy auprwly",null,null,null,null,null,null,null,null,20]
[null,null,null,null,"pRweIvyt skUl iv`coN G~to G`t do ividAwrQI srkwrI skUL iv`c dwKl krvwaux qy\"",null,null,null,null,null,null,null,10]
[null,null,null,null,"pRI pRwiemrI iv`c pRwiemrI dy ku`l dwKl ividAwrQIAW dw\n40% dwKl ",null,null,null,null,null,null,null,10]
[null,null,null,null,"AiDAwpk duAwrw pRwiemrI  iv`c pVHwey jw rhy ividAwrQIAW dI mjOdw  igxqI iv~c G~to G~t 5 % dw vwDw krn qy",null,null,null,null,null,null,null,10]
[null,null,null,"\n2","AwpxI jmwq dy dwKl ividAwrQIAW nUM AglI jmwq ivc dwKl krn qy",null,null,null,null,null,null,null,null,10]
[null,null,null,null,"80% b`cy dwKl krn qy",null,null,null,null,null,null,null,2]
[null,null,null,null,"90% b`cy dwKl krn qy",null,null,null,null,null,null,null,5]
[null,null,null,null,"100% b`cy dwKl krn qy",null,null,null,null,null,null,null,10]
[null,null,null,3,"AiDAwpk dy Awpxy b~cy srkwrI skUl iv`c pVHdy hox qy (pRI pRweImrI qoNN bwrvIN q~k) \nnot : \n(a) ijnHW AiDAwpkW dI sMqwn nhIN  hY jW Ajy kuAwry/kuAwrIAW hn, auhnW AiDAwpkW nUM 10 nMbr Alwt kIqy jwx [\n(A) ijnHW AiDAwpkW dy b~cy 10+2 q~k is~iKAw pRwpq krn dI aumr lMG cu~ky hn, auhnW AiDAwpkW nuM vI 10 nMbr Alwt kIqy jwx [ ",null,null,null,null,null,null,null,10,10]
[null,null,null,4,"b`icAW iv`c suMdr ilKweI ivkisq krn leI kIqy gey auprwly ",null,null,null,null,null,null,null,"",10]
[null,null,null,"","sYNtr p`Dr qy G`to-G`t AwpxI jmwq dy ivAwrQIAW dy Bwg lYx qy",null,null,null,null,null,null,null,2]
[null,null,null,"","blwk p`Dr qy G`to-G`t AwpxI jmwq dy ivAwrQIAW dy Bwg lYx qy",null,null,null,null,null,null,null,5]
[null,null,null,"","ijLHw p`Dr qy G`to-G`t AwpxI jmwq dy ivAwrQIAW dy Bwg lYx qy",null,null,null,null,null,null,null,8]
[null,null,null,"","AMqr ijLw p`Dr qy G`to-G`t AwpxI jmwq dy ivAwrQIAW dy Bwg lYx qy",null,null,null,null,null,null,null,10]
[null,null,null,5,"AiDAwpkW duAwrw skUl dI ibhqrI leI kimaUintI dy sihXog nwl kIqy gey kMmW dw vyrvw",null,null,null,null,null,null,null,"",10]
[null,null,null,null,"iek jmwq kmry dw suMdrIkrn jW buinAwdI FWcw iqAwr krn jW krvwaux qy",null,null,null,null,null,null,null,5]
[null,null,null,null,"skUL dI iemwrq dw suMdrIkrn jW buinAwdI FWcw iqAwr krn jW krvwaux qy",null,null,null,null,null,null,null,10]
[null,null,null,6,"ividAwrQIAW dIAW ivSyS jmwqW/kYNp leI kIqy gey au~dm",null,null,null,null,null,null,null,"",5]
[null,null,null,"","srdIAW dIAW Cu~tIAW dOrwn ivSyS isKlweI kYNp leI",null,null,null,null,null,null,null,2]
[null,null,null,null,"skUl smyN qoN pihlW jW bwAd jmwqW lgwaux leI (20-30 idnW q`k)"]
[null,null,null,"","grmIAW dIAW Cu~tIAW dOrwn smr kYNp lgwaux leI (5-10 idnW q`k)",null,null,null,null,null,null,null,5]
[null,null,null,7,"lwiebryrI/rIifMg kOrnr dy ivkisq krn leI kIqy auprwly",null,null,null,null,null,null,null,"",5]
[null,null,null,"","AiDAwpk duAwrw Awpxy XqnW rwhIN bu`k bYNk ivkisq krn qy",null,null,null,null,null,null,null,2]
[null,null,null,"","nmUny dI rIifMg kwrnr bxwaux qy Aqy pVweI jw rhI jmwq dy ku`l b`icAW dI igxqI qoN pMj guxW ikqwbW rIifMg kwrnr (lwiebryrI) nwl sbMDq Awp jW dwnI s`jxw qoN iek`TIAW krn qy",null,null,null,null,null,null,null,5]
[null,null,null,8,"sYSn dOrwn pRsMsw p~qr/Avwrf pRwpq krn qy",null,null,null,null,null,null,null,"",10]
[null,null,null,"","blwk/ qihsIl p~Dr qy",null,null,null,null,null,null,null,2]
[null,null,null,null,"ijlHw p~Dr qy",null,null,null,null,null,null,null,3]
[null,null,null,"","styt p~Dr qy/ivBwg dy au~c AiDkwrIAW qoN ivSyS pRsMsw p~qr pRwpq krn qy",null,null,null,null,null,null,null,8]
[null,null,null,"","nYSnl Avwrf pRwpq krn qy",null,null,null,null,null,null,null,10]
[null,null,null,9,"ividAwrQIAW AMdr pMjwbI Aqy AMgryjI dI sbd sUcI (Vocabulary) dy vwDy leI kIqy gey auprly",null,null,null,null,null,null,null,"",5]
[null,null,null,null,"pihlI jmwq leI pMjwbI Aqy AMgryzI dy G``toN-G`t 40-40 Sbd",null,null,null,null,null,null,null,5]
[null,null,null,null,"dUjI jmwq leI pMjwbI Aqy AMgryzI dy G``toN-G`t 100-100 Sbd"]
[null,null,null,null,"qIjI jmwq leI pMjwbI Aqy AMgryzI dy G``toN-G`t 150-150 Sbd"]
[null,null,null,null,"cOQI jmwq leI pMjwbI Aqy AMgryzI dy G``toN-G`t 200-200 Sbd"]
[null,null,null,null,"pMjvIN jmwq leI pMjwbI Aqy AMgryzI dy G``toN-G`t 250-250 Sbd"]
[null,null,null,10,"AiDAwpk dw ividAwrQIAW dy mipAW nwl rwbqw",null,null,null,null,null,null,null,"",10]
[null,null,null,null,"skUl iv`c mIitMgW rwhIN",null,null,null,null,null,null,null,2]
[null,null,null,null,"in`jI rUp iv`c",null,null,null,null,null,null,null,5]
[null,null,null,null,"vtsAYp gru~p rwhIN/SoSl mIfIAw rwhIN",null,null,null,null,null,null,null,3]
[null,null,null,11,"ivBwg duAwrw kwrjkuSlqw vDwaux leI pVHo pMjwb pVwE pMjwb ADIn AwXoijq kIqIAW jwx vwlIAW tRyinMgj/sYmInwr iv`c BwgIdwrI",null,null,null,null,null,null,null,5,5]
[null,null,null,12,"AiDAwpk dI kimaUintI v~loN Awpxy skUl iv`c pwey Xogdwn dI SlwGw",null,null,null,null,null,null,null,null,5]
[null,null,null,null,"SoSl mIfIAw rwhIN",null,null,null,null,null,null,null,2]
[null,null,null,null,"ipRMt mIfIAw rwhIN",null,null,null,null,null,null,null,3]
[null,null,null,null,"ielYktRoinks mIfIAw rwhIN",null,null,null,null,null,null,null,5]
[null,null,null,13,"svyr dI sBw",null,null,null,null,null,null,null,null,10]
[null,null,null,null,"rojwnw ByjI jWdI slweIf Anuswr krvweI sBw",null,null,null,null,null,null,null,5]
[null,null,null,null,"swaUNf isstm, frMm Aid duAwrw krvweI sBw",null,null,null,null,null,null,null,5]
[null,null,null,14,"skUl ivc kIqw igAw rMg-rogn, vDIAw idK Aqy (BALA)  skIm (Building as Learning Aid) ADIn hoieAw kMm",null,null,null,null,null,null,null,5,5]
[null,null,null,15,"skUl iv`c h`Q ilKq mYgjIn iqAwr krvwaux qy",null,null,null,null,null,null,null,null,5]
[null,null,null,null,"AiDAwpk v`loN b`icAW qoN h`Q ilKq mYgjIn iqAwr krn iv`c sihXog dyx qy",null,null,null,null,null,null,null,2]
[null,null,null,null,"kyvl AwpxIAW jmwqW dy 50 pRqIsq ividAwrQIAW dIAW rcnwvW skUl mYgjIn iv`c swiml krn q",null,null,null,null,null,null,null,3]
[null,null,null,16,"AiDAwpk v`loN mltI mIfIAw/eI-kMntYNt dI vrqoN jmwq ivc hr roz krn qy",null,null,null,null,null,null,null,10,10]
[null,null,null,17,"AiDAwpk duAwrw pVHweI jw rhI jmwq dy hryk ividAwrQI nUM tIcy Anuswr phwVy Awaux qy",null,null,null,null,null,null,null,5,5]
[null,null,null,18,"AiDAwpk v~loN isrP is~iKAw nwl sbMDq skwrwqimk AwrtIkl/lyK ipRMt mIfIAw iv`c pRkwiSq hox qy",null,null,null,null,null,null,null,null,5]
[null,null,null,null,"skUl mYgjIn iv`c AiDAwpk dIAW AwpxIAW G`toN-G`t 5 rcnwvW Swiml hox qy",null,null,null,null,null,null,null,2]
[null,null,null,null,"AwrtIkl/lyK pRkwiSq hox q",null,null,null,null,null,null,null,3]
[null,null,null,null,"is~iKAw Kyqr nwl sbMDq ie~k ikqwb pRkwSq hoxy qy",null,null,null,null,null,null,null,5]
[null,null,null,"(s-2) sih Akwdimk ikirAwvW (Co-currucular Activities)"]
[null,null,null,"lVI nM:","sih Akwdimk gqIivDIAW",null,null,null,null,null,null,null,"ku~l AMk","v~D qoN v~D  AMk","pRwpq AMk"]
[null,null,null,1,"ividAwrQIAW dI KyfW iv`c smUlIAq krvwaux qy",null,null,null,null,null,null,null,null,5]
[null,null,null,null,"sYNtr p`Dr qy (pRqI jmwq 02 b`icAW dI smUlIAq)",null,null,null,null,null,null,null,1]
[null,null,null,null,"blwk p`Dr qy (AwpxI jmwq dy b`icAW dI smUlIAq)",null,null,null,null,null,null,null,2]
[null,null,null,null,"ijlHw p`Dr qy (AwpxI jmwq dy b`icAW dI smUlIAq)",null,null,null,null,null,null,null,3]
[null,null,null,null,"AMqr ijlHw p`Dr qy (AwpxI jmwq dy b`icAW dI smUlIAq)",null,null,null,null,null,null,null,5]
[null,null,null,2,"ividAwrQIAW dI ividAwk mukwbilAw iv`c smUlIAq krvwaux qy",null,null,null,null,null,null,null,null,5]
[null,null,null,null,"sYNtr p`Dr qy (pRqI jmwq 02 b`icAW dI smUlIAq)",null,null,null,null,null,null,null,1]
[null,null,null,null,"blwk p`Dr qy (AwpxI jmwq dy b`icAW dI smUlIAq)",null,null,null,null,null,null,null,2]
{"$rows_left_out":58}
{"sheet":"Sheet1","index":2,"n_rows":9,"n_cols":1,"rows_kept":9,"cut":false,"hidden":true,"merged":[]}
[]
["Class P"]
["ਪਹਿਲੀ"]
["ਦੂਜੀ"]
["ਤੀਜੀ"]
["ਚੌਥੀ"]
["ਪੰਜਵੀਂ"]
["ਨਰਸਰੀ"]
["ਪ੍ਰੀਨਰਸਰੀ"]

{"sheet":"Sheet4","index":3,"n_rows":568,"n_cols":7,"rows_kept":568,"cut":false,"hidden":true,"merged":[]}
[6,"06:Drawind/Painting related Lecturer/Teachers (Grading)",2,"frwieMg/pyitMg/ic~qrklw ivSy nwl sbMDq lYkcrwr/AiDAwpk  dI slwnw mulWkx irport \ngryifMg ivSw hox qy     (ey.sI.Awr.-6)","AiDAwpk/AiDAwpkw dw nW","AiDAwpk v~loN kYlMfr swl iv`c leIAW Cu~tIAW: ","Yes"]
[8,"08:Physical Education Lecturer/Teachers (Grading)",4,"srIrk is`iKAw lYkcrwr/AiDAwpk  dI slwnw mulWkx irport \ngryifMg ivSw hox qy  (ey.sI.Awr.-8)","AiDAwpk/AiDAwpkw dw nW","AiDAwpk v~loN kYlMfr swl iv`c leIAW Cu~tIAW: ","No"]
[10,"10: Vocational Lecturer/Teachers (Grading)",6,"vokySnl lYkcrwr/AiDAwpk  dI slwnw mulWkx irport \ngryifMg ivSw hox qy     (ey.sI.Awr.-10)","AiDAwpk/AiDAwpkw dw nW","AiDAwpk v~loN kYlMfr swl iv`c leIAW Cu~tIAW: "]
[13,"13:Other Subject Lecturer/Teachers (as Agriculture,Home Science,Music etc.) Grading",8,"hor ivSy dy AiDAwpk/lYkcrwr  dI slwnw mulWkx irport \n(ijvyN KyqIbwVI, hom swieMs, imaUjk) : gryifMg ivSw hox qy \n(ey.sI.Awr.-13)","AiDAwpk/AiDAwpkw dw nW","AiDAwpk v~loN kYlMfr swl iv`c leIAW Cu~tIAW: "]
[]
[]
[]
[]
[]
[]
[]
[]
[]
[14,"6th","Middle","CyvIN"]
[null,"7th","Middle","s~qvIN"]
[null,"8th","Middle","A~TvIN"]
[null,"9th","Matric","nOvIN"]
[null,"10th","Matric","dsvIN"]
[null,"11th","Secondary","10+1 "]
[null,"12th","Secondary","10+2"]
[]
[]
[]
[]
[]
[]
[]
[]
[]
[]
[]
[]
[]
[]
[]
[]
[]
[]
[]
[]
[]
[]
[]
[]
[]
[]
[]
[]
[]
[]
[]
[]
[]
[]
[]
[]
[]
[]
[]
[]
[]
[]
[]
[]
[]
[]
[]
[]
[]
[]
[3,"AiDAwpn kwrz",null,20,5]
[null,"inrMqr Aqy imqI b~D kwpIAW dI jWc",4]
[null,"ivSy nwl sbMDq frwieMg PweIlW iv`c suMdr Aqy AwkrSk ic~qr bxwaux leI kIqy auprwilAW leI",4]
[null,"AiDAwpk fwierI",4]
[null,"svyr dI sBw iv`c BwSx (mhINny iv`c G~to-G~t do vwrI)",4]
[null,"AiDAwpk v~loN klws tYst lYx Aqy irkwrf myntyn krn qy (mhINny iv`c G~to-G~t do vwrI)",4]
[4,"ivSyS ijMymyvwrI/ieMcwrjiSp",null,10]
[null,"skwaUt,AYn.sI.sI., AYn.AYs.AYs. ieMcwrz",2]
[null,"dwKlw Kwrz ieMcwrz",2]
[null,"hwaUs ieMcwrz",2]
[null,"imf-fy-mIl ieMcwrz",2]
[null,"tweIm tybl ieMcrj",2]
[5,"frwieMg rUm/pyitMg kOrnr dy ivkisq krn leI kIqy auprwly",null,10]
[null,"nmUny dw pyitMg kOrnr ivkisq krn/ r~K rKwA krn qy",5]
[null,"nmUny dw frwieMg / pyitMg rUm ivkisq krn qy Aqy rUm nwl sbMDq Awp jW dwnI s~jxw qoN mYtIrIAl (pyitMgz) iek~TYIAW krn qy",5]
[null,"AiDAwpk duAwrw Awpxy XqnW / ivSy dy ividAwrQIAW rwhIN skUl iv`c mwto, smW swrxI, nkSy Awid bxwaux qy",5]
[6,"ividAwrQIAW dIAW ivSyS jmwqW/kYNp leI kIqy gey au~dm",null,10]
[null,"srdIAW dIAW Cu~tIAW dOrwn ivSyS isKlweI kYNp/ jmwqW leI",2]
[null,"skUl smyN qoN pihlW jW bwAd jmwqW lgwaux leI",3]
[null,"grmIAW dIAW Cu~tIAW dOrwn smr kYNp/ jmwqW lgwaux leI (7-10 idn)",5]
[7,"AiDAwpk dI ivSy iv`c muhwrq",null,10]
[null,"jy AiDAwpk ic~qrklw frwieMg iv`c muhwrq r~Kdw hY qW",5]
[null,"jy AiDAwpk skyl frwieMg / mkYnIkl frwieMg iv`c muhwrq r~Kdw hY qW",5]
[8,"AiDAwpk v~loN is~Kx isKwaux sm~grI (tI.Ayl.Aym.) dI vrqoN krn qy",null,20]
[null,"vwtr klr Aqy Awiel pystl klr dI vrqoN",3]
[null,"poAwieMt Aqy PlYt burS dI vrqoN",4]
[null,"klyA molifMg dI isKlweI",3]
[null,"pYnisl skYicMg Aqy SyifMg dI isKlweI",3]
[null,"jmwq iv~c frwieMg borf dI vrqoN",4]
[null,"v~K v~K qrW dIAW pYnislW dI jwxkwrI Aqy vrqoN",3]
[9,"mltImIfIAW rwhIN/ ieMnovyitv qrIky nwl is~iKAw pRdwn krn leI kIqy audm",null,10]
[null,"kMipaUtr rwhIN rMgW dw imSrx isKwaux qy",5]
[null,"mltImIfIAW rwhIN ivSy nUM rock aqy pRBwv pUrn bxwaux leI jmwq iuv`c vrqoN",5]
[null,"gqIivDIAW Adwirq is~Kx-isKwaux pRikrIAw Apnwaux qy",5]
[10,"AiDAwpk duAwrw Awpxy Kyqr iv~c ivSyS nwmxw K~tx qy",10,10]
[11,"ivSy nwl sbMDq tUr/Awrt gYlrI dI ivzt krvwaux qy",10,10]
[12,"ivSy nwl sbMDq v~K v~K idvs mnwauxw Aqy irkwrf myntyn krn qy",5,5]
[13,"skUl dw mYgzIn iqAwr krnw",null,5]
[null,"AiDAwpk v~loN skUl dy mYgzIn iqAwr krn iv`c Aqy pRkwiSq krvwaux iv`c sihXog dyx qy",5]
[14,"sYSn dOrwn pRsMsw p~qr/Avwrf pRwpq krn qy",null,10]
[null,"blwk/ qihsIl p~Dr qy",2]
[null,"ijlHw p~Dr qy",3]
[null,"styt p~Dr qy",5]
[null,"ivBwg dy au~c AiDkwrIAW qoN ivSyS pRsMsw p~qr pRwpq krn qy",10]
[null,"nYSnl Avwrf pRwpq krn qy",10]
[15,"ividAwrQIAW dIAW ivSy nwl sbMDq mukwbilAW iv`c SmUlIAq krvwaux qy",null,5]
[null,"blwk/ qihsIl p~Dr qy",2]
[null,"ijlHw p~Dr qy",3]
[null,"styt p~Dr qy",5]
[null,"rwStrI p~Dr qy",5]
{"$rows_left_out":448}